Reaction Details
TargetNitroreductase NfsA
LigandBDBM50051698
Substrate/Competitorn/a
Meas. Tech.ChEMBL_206006 (CHEMBL840569)
IC50 7500±n/a nM
Citation Friedlos, FDenny, WAPalmer, BDSpringer, CJ Mustard prodrugs for activation by Escherichia coli nitroreductase in gene-directed enzyme prodrug therapy. J Med Chem40:1270-5 (1997) 
 
Nitroreductase NfsA
Name:Nitroreductase NfsA
Synonyms:Modulator of drug activity A
Type:PROTEIN
Mol. Mass.:26851.30
Organism:Escherichia coli O157:H7
Description:ChEMBL_206006
Residue:240
BDBM50051698
NameBDBM50051698
TypeSmall organic molecule
Emp. Form.C11H12Cl2N4O5
Mol. Mass.351.143
SMILESNC(=O)c1cc(cc(c1N(CCCl)CCCl)[N+]([O-])=O)[N+]([O-])=O