Reaction Details
TargetNitroreductase NfsA
LigandBDBM50057438
Substrate/Competitorn/a
Meas. Tech.ChEMBL_206006 (CHEMBL840569)
IC50 3400±n/a nM
Citation Friedlos, FDenny, WAPalmer, BDSpringer, CJ Mustard prodrugs for activation by Escherichia coli nitroreductase in gene-directed enzyme prodrug therapy. J Med Chem40:1270-5 (1997) 
 
Nitroreductase NfsA
Name:Nitroreductase NfsA
Synonyms:Modulator of drug activity A
Type:PROTEIN
Mol. Mass.:26851.30
Organism:Escherichia coli O157:H7
Description:ChEMBL_206006
Residue:240
BDBM50057438
NameBDBM50057438
TypeSmall organic molecule
Emp. Form.C12H15ClN4O7S
Mol. Mass.394.788
SMILESCS(=O)(=O)CCN(CCCl)c1cc(C(N)=O)c(cc1[N+]([O-])=O)[N+]([O-])=O