Reaction Details
TargetNitroreductase NfsA
LigandBDBM50039133
Substrate/Competitorn/a
Meas. Tech.ChEMBL_206006 (CHEMBL840569)
IC50 250±n/a nM
Citation Friedlos, FDenny, WAPalmer, BDSpringer, CJ Mustard prodrugs for activation by Escherichia coli nitroreductase in gene-directed enzyme prodrug therapy. J Med Chem40:1270-5 (1997) 
 
Nitroreductase NfsA
Name:Nitroreductase NfsA
Synonyms:Modulator of drug activity A
Type:PROTEIN
Mol. Mass.:26851.30
Organism:Escherichia coli O157:H7
Description:ChEMBL_206006
Residue:240
BDBM50039133
NameBDBM50039133
TypeSmall organic molecule
Emp. Form.C11H12Br2N4O5
Mol. Mass.440.045
SMILESNC(=O)c1cc(N(CCBr)CCBr)c(cc1[N+]([O-])=O)[N+]([O-])=O