Reaction Details
TargetNACHT, LRR and PYD domains-containing protein 3
LigandBDBM50012957
Substrate/Competitorn/a
Meas. Tech.ChEMBL_1824381 (CHEMBL4324145)
IC50 10000±n/a nM
Citation Zhang, XXu, ALv, JZhang, QRan, YWei, CWu, J Development of small molecule inhibitors targeting NLRP3 inflammasome pathway for inflammatory diseases. Eur J Med Chem185:0 (2020) 
 
NACHT, LRR and PYD domains-containing protein 3
Name:NACHT, LRR and PYD domains-containing protein 3
Type:PROTEIN
Mol. Mass.:118281.75
Organism:Mus musculus
Description:ChEMBL_116758
Residue:1033
BDBM50012957
NameBDBM50012957
Synonyms:1-((p-(2-(5-chloro-o-anisamido)ethyl)phenyl)sulfonyl)-3-cyclohexylurea 5-chloro-N-(2-(4-((((cyclohexylamino)carbonyl)amino)sulfonyl)phenyl)ethyl)-2-methoxybenzamide CHEMBL472 Glibenclamide | US20230348371, Compound 5
TypeSmall organic molecule
Emp. Form.C23H28ClN3O5S
Mol. Mass.494.004
SMILESCOc1ccc(Cl)cc1C(=O)NCCc1ccc(cc1)S(=O)(=O)NC(=O)NC1CCCCC1