Reaction Details
TargetReverse transcriptase/RNaseH
LigandBDBM50057812
Substrate/Competitorn/a
Meas. Tech.ChEMBL_197125 (CHEMBL803726)
EC50 13000±n/a nM
Citation Adams, DRPerez, CMaillard, MFlorent, JCEvers, MHénin, YLitvak, SLitvak, LMonneret, CGrierson, DS Preparation and anti-HIV activity of N-3-substituted thymidine nucleoside analogs. J Med Chem40:1550-8 (1997) 
 
Reverse transcriptase/RNaseH
Name:Reverse transcriptase/RNaseH
Type:PROTEIN
Mol. Mass.:65229.15
Organism:Human immunodeficiency virus 1
Description:ChEMBL_1473730
Residue:566
BDBM50057812
NameBDBM50057812
Synonyms:1-(4-Azido-5-hydroxymethyl-tetrahydro-furan-2-yl)-3-(2,2-dimethyl-[1,3]dioxolan-4-ylmethyl)-5-methyl-1H-pyrimidine-2,4-dione | CHEMBL36925
TypeSmall organic molecule
Emp. Form.C16H23N5O6
Mol. Mass.381.3837
SMILESCc1cn(C2CC(N=[N+]=[N-])C(CO)O2)c(=O)n(CC2COC(C)(C)O2)c1=O