Reaction Details
TargetAryl hydrocarbon receptor
LigandBDBM50506038
Substrate/Competitorn/a
Meas. Tech.ChEMBL_1824678 (CHEMBL4324442)
EC50 49.0±n/a nM
Citation Dolciami, DBallarotto, MGargaro, MLópez-Cara, LCFallarino, FMacchiarulo, A Targeting Aryl hydrocarbon receptor for next-generation immunotherapies: Selective modulators (SAhRMs) versus rapidly metabolized ligands (RMAhRLs). Eur J Med Chem185:0 (2020) 
 
Aryl hydrocarbon receptor
Name:Aryl hydrocarbon receptor
Type:PROTEIN
Mol. Mass.:96143.77
Organism:Homo sapiens (Human)
Description:ChEMBL_1503828
Residue:848
BDBM50506038
NameBDBM50506038
Synonyms:CHEMBL4580482
TypeSmall organic molecule
Emp. Form.C13H7Cl3O
Mol. Mass.285.553
SMILESCc1cc(Cl)cc2c1oc1cc(Cl)cc(Cl)c21