Reaction Details
TargetProthrombin
LigandBDBM50057828
Substrate/Competitorn/a
Meas. Tech.ChEMBL_208501 (CHEMBL811976)
Ki 0.1±n/a nM
Citation Tucker, TJLumma, WCLewis, SDGardell, SJLucas, BJBaskin, EPWoltmann, RLynch, JJLyle, EAAppleby, SDChen, IWDancheck, KBVacca, JP Potent noncovalent thrombin inhibitors that utilize the unique amino acid D-dicyclohexylalanine in the P3 position. Implications on oral bioavailability and antithrombotic efficacy. J Med Chem40:1565-9 (1997) 
 
Prothrombin
Name:Prothrombin
Type:Protein
Mol. Mass.:70029.57
Organism:Homo sapiens (Human)
Description:P00734
Residue:622
BDBM50057828
NameBDBM50057828
Synonyms:(S)-1-((R)-2-Amino-3,3-diphenyl-propionyl)-pyrrolidine-2-carboxylic acid (4-amino-cyclohexylmethyl)-amide | CHEMBL416795
TypeSmall organic molecule
Emp. Form.C27H36N4O2
Mol. Mass.448.6003
SMILESN[C@H](C(c1ccccc1)c1ccccc1)C(=O)N1CCC[C@H]1C(=O)NCC1CCC(N)CC1