Reaction Details
TargetHigh affinity nerve growth factor receptor
LigandBDBM50058333
Substrate/Competitorn/a
Meas. Tech.ChEMBL_207482 (CHEMBL808365)
IC50 270±n/a nM
Citation Kaneko, MSaito, YSaito, HMatsumoto, TMatsuda, YVaught, JLDionne, CAAngeles, TSGlicksman, MANeff, NTRotella, DPKauer, JCMallamo, JPHudkins, RLMurakata, C Neurotrophic 3,9-bis[(alkylthio)methyl]-and-bis(alkoxymethyl)-K-252a derivatives. J Med Chem40:1863-9 (1997) 
 
High affinity nerve growth factor receptor
Name:High affinity nerve growth factor receptor
Type:n/a
Mol. Mass.:87498.18
Organism:Homo sapiens (Human)
Description:P04629
Residue:796
BDBM50058333
NameBDBM50058333
Synonyms:CHEMBL291985 | methyl 16-hydroxy-10,23-di(methoxymethyl)-15-methyl-3-oxo-(15S,16R)-28-oxa-4,14,19-triazaoctacyclo[12.11.2.115,18.02,6.07,27.08,13.019,26.020,25]octacosa-1(26),2(6),7(27),8,10,12,20(25),21,23-nonaene-16-carboxylate
TypeSmall organic molecule
Emp. Form.C31H29N3O7
Mol. Mass.555.5779
SMILESCOCc1ccc2n3C4C[C@](O)(C(=O)OC)[C@](C)(O4)n4c5ccc(COC)cc5c5c6CNC(=O)c6c(c2c1)c3c45