Reaction Details
TargetNeutrophil elastase
LigandBDBM50058495
Substrate/Competitorn/a
Meas. Tech.ChEMBL_63796 (CHEMBL679049)
IC50 0.1±n/a nM
Citation Portevin, BLonchampt, MCanet, EDe Nanteuil, G Dual inhibition of human leukocyte elastase and lipid peroxidation: in vitro and in vivo activities of azabicyclo[2.2.2]octane and perhydroindole derivatives. J Med Chem40:1906-18 (1997) 
 
Neutrophil elastase
Name:Neutrophil elastase
Type:Enzyme
Mol. Mass.:28532.38
Organism:Homo sapiens (Human)
Description:P08246
Residue:267
BDBM50058495
NameBDBM50058495
Synonyms:3-{2-[2-(Thiophene-2-carbonylsulfanyl)-propionylamino]-acetyl}-thiazolidine-4-carboxylic acid | CHEMBL293138
TypeSmall organic molecule
Emp. Form.C14H16N2O5S3
Mol. Mass.388.482
SMILESCC(SC(=O)c1cccs1)C(=O)NCC(=O)N1CSCC1C(O)=O