Reaction Details
TargetPhosphodiesterase
LigandBDBM50059041
Substrate/Competitorn/a
Meas. Tech.ChEMBL_156454 (CHEMBL764832)
IC50 35000±n/a nM
Citation Ahn, HSBercovici, ABoykow, GBronnenkant, AChackalamannil, SChow, JCleven, RCook, JCzarniecki, MDomalski, CFawzi, AGreen, MGündes, AHo, GLaudicina, MLindo, NMa, KManna, MMcKittrick, BMirzai, BNechuta, TNeustadt, BPuchalski, CPula, KZhang, H Potent tetracyclic guanine inhibitors of PDE1 and PDE5 cyclic guanosine monophosphate phosphodiesterases with oral antihypertensive activity. J Med Chem40:2196-210 (1997) 
 
Phosphodiesterase
Name:Phosphodiesterase
Type:PROTEIN
Mol. Mass.:124301.20
Organism:Bos taurus
Description:ChEMBL_156453
Residue:1115
BDBM50059041
NameBDBM50059041
Synonyms:(6aR,9aS)-2-Hexyl-5,6a,7,8,9,9a-hexahydro-5-methyl-3-(phenylmethyl)cyclopent[4,5]imidazo[2,1-b]purin-4(3H)-one | CHEMBL303385
TypeSmall organic molecule
Emp. Form.C24H31N5O
Mol. Mass.405.5358
SMILESCCCCCCc1nc2N3[C@H]4CCC[C@H]4N=C3N(C)C(=O)c2n1Cc1ccccc1