Reaction Details
TargetKappa-type opioid receptor
LigandBDBM50297170
Substrate/Competitorn/a
Meas. Tech.ChEMBL_145565 (CHEMBL749569)
Ki>3000±n/a nM
Citation Fang, XLarson, DLPortoghese, PS 7-spirobenzocyclohexyl derivatives of naltrexone, oxymorphone, and hydromorphone as selective opioid receptor ligands. J Med Chem40:3064-70 (1997) 
 
Kappa-type opioid receptor
Name:Kappa-type opioid receptor
Type:Enzyme
Mol. Mass.:42656.78
Organism:Mus musculus (Mouse)
Description:P33534
Residue:380
BDBM50297170
NameBDBM50297170
Synonyms:7-(2'-spiroindanyl)oxymorphone 7-spiroindanyloxymorphone SIOM | Spiroindanyloxymorphone
TypeSmall organic molecule
Emp. Form.C25H25NO4
Mol. Mass.403.4703
SMILESCN1CC[C@@]23[C@H]4Oc5c2c(C[C@@H]1[C@]3(O)CC1(Cc2ccccc2C1)C4=O)ccc5O