Reaction Details
TargetDelta-type opioid receptor
LigandBDBM50059992
Substrate/Competitorn/a
Meas. Tech.ChEMBL_146341 (CHEMBL753790)
Ki 182±n/a nM
Citation Fang, XLarson, DLPortoghese, PS 7-spirobenzocyclohexyl derivatives of naltrexone, oxymorphone, and hydromorphone as selective opioid receptor ligands. J Med Chem40:3064-70 (1997) 
 
Delta-type opioid receptor
Name:Delta-type opioid receptor
Type:Enzyme Catalytic Domain
Mol. Mass.:40577.25
Organism:MOUSE
Description:P32300
Residue:372
BDBM50059992
NameBDBM50059992
Synonyms:7 alpha-Spirobenzocyclohexylhydromorphone | CHEMBL318361
TypeSmall organic molecule
Emp. Form.C26H27NO3
Mol. Mass.401.4975
SMILESCN1CCC23[C@H]4Oc5c2c(CC1[C@@H]3C[C@@]1(CCc2ccccc2C1)C4=O)ccc5O