Reaction Details
TargetKappa-type opioid receptor
LigandBDBM50059997
Substrate/Competitorn/a
Meas. Tech.ChEMBL_145565 (CHEMBL749569)
Ki>1000±n/a nM
Citation Fang, XLarson, DLPortoghese, PS 7-spirobenzocyclohexyl derivatives of naltrexone, oxymorphone, and hydromorphone as selective opioid receptor ligands. J Med Chem40:3064-70 (1997) 
 
Kappa-type opioid receptor
Name:Kappa-type opioid receptor
Type:Enzyme
Mol. Mass.:42656.78
Organism:Mus musculus (Mouse)
Description:P33534
Residue:380
BDBM50059997
NameBDBM50059997
Synonyms:7 beta-Spirobenzocyclohexylnaltrexone | CHEMBL101694
TypeSmall organic molecule
Emp. Form.C29H31NO4
Mol. Mass.457.5607
SMILESOc1ccc2CC3N(CC4CC4)CCC45[C@@H](Oc1c24)C(=O)[C@@]1(CCc2ccccc2C1)C[C@@]35O