Reaction Details
TargetKappa-type opioid receptor
LigandBDBM50059996
Substrate/Competitorn/a
Meas. Tech.ChEMBL_145565 (CHEMBL749569)
Ki 88±n/a nM
Citation Fang, XLarson, DLPortoghese, PS 7-spirobenzocyclohexyl derivatives of naltrexone, oxymorphone, and hydromorphone as selective opioid receptor ligands. J Med Chem40:3064-70 (1997) 
 
Kappa-type opioid receptor
Name:Kappa-type opioid receptor
Type:Enzyme
Mol. Mass.:42656.78
Organism:Mus musculus (Mouse)
Description:P33534
Residue:380
BDBM50059996
NameBDBM50059996
Synonyms:7 beta-Spirobenzocyclohexylhydromorphone | CHEMBL104159
TypeSmall organic molecule
Emp. Form.C26H27NO3
Mol. Mass.401.4975
SMILESCN1CCC23[C@H]4Oc5c2c(CC1[C@@H]3C[C@]1(CCc2ccccc2C1)C4=O)ccc5O