Reaction Details
TargetMu-type opioid receptor
LigandBDBM50058152
Substrate/Competitorn/a
Meas. Tech.ChEMBL_148517 (CHEMBL758127)
Ki 1.50±n/a nM
Citation Fang, XLarson, DLPortoghese, PS 7-spirobenzocyclohexyl derivatives of naltrexone, oxymorphone, and hydromorphone as selective opioid receptor ligands. J Med Chem40:3064-70 (1997) 
 
Mu-type opioid receptor
Name:Mu-type opioid receptor
Type:Enzyme Catalytic Domain
Mol. Mass.:44431.62
Organism:MOUSE
Description:OPIATE Mu OPRM1 MOUSE::P42866
Residue:398
BDBM50058152
NameBDBM50058152
Synonyms:7-(2''-spiroindanyl)naltrexone | CHEMBL610293
TypeSmall organic molecule
Emp. Form.C28H29NO4
Mol. Mass.443.5342
SMILES[H][C@@]12Oc3c4c(C[C@@]5([H])N(CC6CC6)CC[C@@]14[C@@]5(O)CC1(Cc4ccccc4C1)C2=O)ccc3O