Reaction Details
TargetCytochrome P450 1B1
LigandBDBM23926
Substrate/Competitorn/a
Meas. Tech.ChEMBL_1830577 (CHEMBL4330585)
Ki 750±n/a nM
Citation Mohd Siddique, MUBarbhuiya, TKSinha, BNJayaprakash, V Phytoestrogens and their synthetic analogues as substrate mimic inhibitors of CYP1B1. Eur J Med Chem163:28-36 (2019) 
 
Cytochrome P450 1B1
Name:Cytochrome P450 1B1
Type:PROTEIN
Mol. Mass.:60861.81
Organism:Homo sapiens (Human)
Description:ChEMBL_1474523
Residue:543
BDBM23926
NameBDBM23926
Synonyms:(E)-resveratrol CHEMBL165 Stilbene, 2f cid_445154 trans-resveratrol
TypeSmall organic molecule
Emp. Form.C14H12O3
Mol. Mass.228.2433
SMILESOc1ccc(\C=C\c2cc(O)cc(O)c2)cc1