Reaction Details
TargetIntegrin alpha-IIb/beta-3
LigandBDBM50060308
Substrate/Competitorn/a
Meas. Tech.ChEMBL_89416 (CHEMBL700463)
IC50 42.0±n/a nM
Citation Badorc, ABordes, MFde Cointet, PSavi, PBernat, ALalé, APetitou, MMaffrand, JPHerbert, JM New orally active non-peptide fibrinogen receptor (GpIIb-IIIa) antagonists: identification of ethyl 3-[N-[4-[4-[amino[(ethoxycarbonyl) imino]methyl]phenyl]-1,3-thiazol-2-yl]-N-[1-[(ethoxycarbonyl)methyl]pip erid -4-yl]amino]propionate (SR 121787) as a potent and long-acting antithrombotic agent. J Med Chem40:3393-401 (1997) 
 
Integrin alpha-IIb/beta-3
Name:Integrin alpha-IIb/beta-3
Synonyms:Glycoprotein IIb/IIIa
Type:n/a
Mol. Mass.:n/a
Description:ASSAY_ID of EBI is 30109
Components:This complex has 2 components.
Component 1
Name:Integrin beta-3
Type:Protein
Mol. Mass.:87038.91
Organism:Homo sapiens (Human)
Description:P05106
Residue:788
Component 2
Name:Integrin alpha-IIb
Synonyms:CD_antigen=CD41 GPIIb Glycoprotein IIb ITGA2B Integrin alpha-IIb heavy chain Integrin alpha-IIb light chain, form 2 Integrin alpha-V/beta-3 and alpha-IIb/beta 3 | Platelet membrane glycoprotein IIb
Type:Protein
Mol. Mass.:113354.85
Organism:Homo sapiens (Human)
Description:P08514
Residue:1039
BDBM50060308
NameBDBM50060308
Synonyms:CHEMBL115191 | {4-[4-(4-Carbamimidoyl-phenyl)-thiazol-2-ylamino]-piperidin-1-yl}-acetic acid
TypeSmall organic molecule
Emp. Form.C17H21N5O2S
Mol. Mass.359.446
SMILESNC(=N)c1ccc(cc1)-c1csc(NC2CCN(CC(O)=O)CC2)n1