Reaction Details
TargetNeutrophil elastase
LigandBDBM50060329
Substrate/Competitorn/a
Meas. Tech.ChEMBL_63999 (CHEMBL673108)
Ki 1300±n/a nM
Citation Regan, JMcGarry, DBruno, JGreen, DNewman, JHsu, CYKline, JBarton, JTravis, JChoi, YMVolz, FPauls, HHarrison, RZilberstein, ABen-Sasson, SAChang, M Anionic- and lipophilic-mediated surface binding inhibitors of human leukocyte elastase. J Med Chem40:3408-22 (1997) 
 
Neutrophil elastase
Name:Neutrophil elastase
Type:Enzyme
Mol. Mass.:28532.38
Organism:Homo sapiens (Human)
Description:P08246
Residue:267
BDBM50060329
NameBDBM50060329
Synonyms:CHEMBL385442 | {2-{4-[5-Carboxymethoxy-4-(5-hydroxy-2-methoxy-4-methyl-benzyl)-2-methoxy-benzyl]-5-hydroxy-2-methoxy-benzyl}-5-[4-(2-carboxymethoxy-5-methoxy-benzyl)-2-hydroxy-5-methoxy-benzyl]-4-methoxy-phenoxy}-acetic acid
TypeSmall organic molecule
Emp. Form.C54H56O18
Mol. Mass.993.0116
SMILESCOc1ccc(OCC(O)=O)c(Cc2cc(O)c(Cc3cc(OCC(O)=O)c(Cc4cc(O)c(Cc5cc(OCC(O)=O)c(Cc6cc(O)c(C)cc6OC)cc5OC)cc4OC)cc3OC)cc2OC)c1