Reaction Details
TargetProthrombin
LigandBDBM50060332
Substrate/Competitorn/a
Meas. Tech.ChEMBL_208499 (CHEMBL811974)
pH7.5±n/a
Ki 240±n/a nM
Commentsextracted
Citation Regan, JMcGarry, DBruno, JGreen, DNewman, JHsu, CYKline, JBarton, JTravis, JChoi, YMVolz, FPauls, HHarrison, RZilberstein, ABen-Sasson, SAChang, M Anionic- and lipophilic-mediated surface binding inhibitors of human leukocyte elastase. J Med Chem40:3408-22 (1997) 
 
Prothrombin
Name:Prothrombin
Type:Protein
Mol. Mass.:70029.57
Organism:Homo sapiens (Human)
Description:P00734
Residue:622
BDBM50060332
NameBDBM50060332
Synonyms:CHEMBL215927
TypeSmall organic molecule
Emp. Form.C66H80O24
Mol. Mass.1257.327
SMILESCOCCOCOc1cc(Cc2cc(OC)c(Cc3cc(OC)c(Cc4cc(OC)c(Cc5cc(OC)c(Cc6cc(OC)ccc6OCC(O)=O)cc5OCOCCOC)cc4OCC(O)=O)cc3OCOCCOC)cc2OCC(O)=O)c(OC)cc1C