Reaction Details
TargetCytochrome P450 1A2
LigandBDBM50060418
Substrate/Competitorn/a
Meas. Tech.ChEMBL_51361 (CHEMBL663693)
IC50 13±n/a nM
Citation Bromidge, SMDuckworth, MForbes, ITHam, PKing, FDThewlis, KMBlaney, FENaylor, CBBlackburn, TPKennett, GAWood, MDClarke, SE 6-Chloro-5-methyl-1-[[2-[(2-methyl-3-pyridyl)oxy]-5-pyridyl]carbamoyl]- indoline (SB-242084): the first selective and brain penetrant 5-HT2C receptor antagonist. J Med Chem40:3494-6 (1997) 
 
Cytochrome P450 1A2
Name:Cytochrome P450 1A2
Type:Enzyme
Mol. Mass.:58423.38
Organism:Homo sapiens (Human)
Description:P05177
Residue:516
BDBM50060418
NameBDBM50060418
Synonyms:5-Methylsulfanyl-6-trifluoromethyl-2,3-dihydro-indole-1-carboxylic acid pyridin-3-ylamide SB 221284
TypeSmall organic molecule
Emp. Form.C16H14F3N3OS
Mol. Mass.353.362
SMILESCSc1cc2CCN(C(=O)Nc3cccnc3)c2cc1C(F)(F)F