Reaction Details
Target5-hydroxytryptamine receptor 1D
LigandBDBM50060420
Substrate/Competitorn/a
Meas. Tech.ChEMBL_1697 (CHEMBL616904)
IC50 2.3±n/a nM
Citation Castro, JLStreet, LJGuiblin, ARJelley, RARussell, MGSternfeld, FBeer, MSStanton, JAMatassa, VG 3-[2-(Pyrrolidin-1-yl)ethyl]indoles and 3-[3-(piperidin-1-yl)propyl]indoles: agonists for the h5-HT1D receptor with high selectivity over the h5-HT1B subtype. J Med Chem40:3497-500 (1997) 
 
5-hydroxytryptamine receptor 1D
Name:5-hydroxytryptamine receptor 1D
Type:G Protein-Coupled Receptor (GPCR)
Mol. Mass.:41920.63
Organism:Homo sapiens (Human)
Description:Receptor binding assays were performed using human clone stably expressed in CHO cells.
Residue:377
BDBM50060420
NameBDBM50060420
Synonyms:3-[2-((R)-3-Benzyloxymethyl-pyrrolidin-1-yl)-ethyl]-5-[1,2,4]triazol-4-yl-1H-indole | CHEMBL326371
TypeSmall organic molecule
Emp. Form.C24H27N5O
Mol. Mass.401.5041
SMILESC(Cc1c[nH]c2ccc(cc12)-n1cnnc1)N1CC[C@@H](COCc2ccccc2)C1