Reaction Details
Target5-hydroxytryptamine receptor 1D
LigandBDBM50060425
Substrate/Competitorn/a
Meas. Tech.ChEMBL_1682 (CHEMBL617042)
EC50 0.930000±n/a nM
Citation Castro, JLStreet, LJGuiblin, ARJelley, RARussell, MGSternfeld, FBeer, MSStanton, JAMatassa, VG 3-[2-(Pyrrolidin-1-yl)ethyl]indoles and 3-[3-(piperidin-1-yl)propyl]indoles: agonists for the h5-HT1D receptor with high selectivity over the h5-HT1B subtype. J Med Chem40:3497-500 (1997) 
 
5-hydroxytryptamine receptor 1D
Name:5-hydroxytryptamine receptor 1D
Type:G Protein-Coupled Receptor (GPCR)
Mol. Mass.:41920.63
Organism:Homo sapiens (Human)
Description:Receptor binding assays were performed using human clone stably expressed in CHO cells.
Residue:377
BDBM50060425
NameBDBM50060425
Synonyms:Benzyl-{(S)-1-[2-(5-[1,2,4]triazol-4-yl-1H-indol-3-yl)-ethyl]-pyrrolidin-3-ylmethyl}-amine L-760790
TypeSmall organic molecule
Emp. Form.C24H28N6
Mol. Mass.400.5193
SMILESC(Cc1c[nH]c2ccc(cc12)-n1cnnc1)N1CC[C@@H](CNCc2ccccc2)C1