Reaction Details
Target5-hydroxytryptamine receptor 1D
LigandBDBM50060422
Substrate/Competitorn/a
Meas. Tech.ChEMBL_1682 (CHEMBL617042)
EC50 0.9±n/a nM
Citation Castro, JLStreet, LJGuiblin, ARJelley, RARussell, MGSternfeld, FBeer, MSStanton, JAMatassa, VG 3-[2-(Pyrrolidin-1-yl)ethyl]indoles and 3-[3-(piperidin-1-yl)propyl]indoles: agonists for the h5-HT1D receptor with high selectivity over the h5-HT1B subtype. J Med Chem40:3497-500 (1997) 
 
5-hydroxytryptamine receptor 1D
Name:5-hydroxytryptamine receptor 1D
Type:G Protein-Coupled Receptor (GPCR)
Mol. Mass.:41920.63
Organism:Homo sapiens (Human)
Description:Receptor binding assays were performed using human clone stably expressed in CHO cells.
Residue:377
BDBM50060422
NameBDBM50060422
Synonyms:Benzyl-methyl-{1-[3-(5-[1,2,4]triazol-4-yl-1H-indol-3-yl)-propyl]-piperidin-4-ylmethyl}-amine | CHEMBL333341
TypeSmall organic molecule
Emp. Form.C27H34N6
Mol. Mass.442.5991
SMILESCN(CC1CCN(CCCc2c[nH]c3ccc(cc23)-n2cnnc2)CC1)Cc1ccccc1