Reaction Details
Target5-hydroxytryptamine receptor 1D
LigandBDBM50060439
Substrate/Competitorn/a
Meas. Tech.ChEMBL_1674 (CHEMBL881820)
EC50 0.6±n/a nM
Citation MacLeod, AMStreet, LJReeve, AJJelley, RASternfeld, FBeer, MSStanton, JAWatt, APRathbone, DMatassa, VG Selective, orally active 5-HT1D receptor agonists as potential antimigraine agents. J Med Chem40:3501-3 (1997) 
 
5-hydroxytryptamine receptor 1D
Name:5-hydroxytryptamine receptor 1D
Type:G Protein-Coupled Receptor (GPCR)
Mol. Mass.:41920.63
Organism:Homo sapiens (Human)
Description:Receptor binding assays were performed using human clone stably expressed in CHO cells.
Residue:377
BDBM50060439
NameBDBM50060439
Synonyms:3-(3-{4-[2-(3,5-Difluoro-phenyl)-ethyl]-piperazin-1-yl}-propyl)-5-[1,2,4]triazol-4-yl-1H-indole | CHEMBL116153
TypeSmall organic molecule
Emp. Form.C25H28F2N6
Mol. Mass.450.5268
SMILESFc1cc(F)cc(CCN2CCN(CCCc3c[nH]c4ccc(cc34)-n3cnnc3)CC2)c1