Reaction Details
Target5-hydroxytryptamine receptor 1D
LigandBDBM50060440
Substrate/Competitorn/a
Meas. Tech.ChEMBL_1674 (CHEMBL881820)
EC50 0.1±n/a nM
Citation MacLeod, AMStreet, LJReeve, AJJelley, RASternfeld, FBeer, MSStanton, JAWatt, APRathbone, DMatassa, VG Selective, orally active 5-HT1D receptor agonists as potential antimigraine agents. J Med Chem40:3501-3 (1997) 
 
5-hydroxytryptamine receptor 1D
Name:5-hydroxytryptamine receptor 1D
Type:G Protein-Coupled Receptor (GPCR)
Mol. Mass.:41920.63
Organism:Homo sapiens (Human)
Description:Receptor binding assays were performed using human clone stably expressed in CHO cells.
Residue:377
BDBM50060440
NameBDBM50060440
Synonyms:3-[3-(4-Benzyl-piperazin-1-yl)-propyl]-5-[1,2,4]triazol-4-yl-1H-indole | CHEMBL65367
TypeSmall organic molecule
Emp. Form.C24H28N6
Mol. Mass.400.5193
SMILESC(CN1CCN(Cc2ccccc2)CC1)Cc1c[nH]c2ccc(cc12)-n1cnnc1