Reaction Details
Target5-hydroxytryptamine receptor 2C
LigandBDBM50005835
Substrate/Competitorn/a
Meas. Tech.ChEMBL_3057 (CHEMBL620675)
IC50 7.3±n/a nM
Citation MacLeod, AMStreet, LJReeve, AJJelley, RASternfeld, FBeer, MSStanton, JAWatt, APRathbone, DMatassa, VG Selective, orally active 5-HT1D receptor agonists as potential antimigraine agents. J Med Chem40:3501-3 (1997) 
 
5-hydroxytryptamine receptor 2C
Name:5-hydroxytryptamine receptor 2C
Type:G Protein-Coupled Receptor (GPCR)
Mol. Mass.:51836.79
Organism:Homo sapiens (Human)
Description:P28335
Residue:458
BDBM50005835
NameBDBM50005835
Synonyms:(3-[2-(dimethylamino)ethyl]-1H-indol-5-yl)-N-methylmethanesulfonamide 1-{3-[2-(dimethylamino)ethyl]-1H-indol-5-yl}-N-methylmethanesulfonamide 3-[2-(dimethylamino)ethyl]-N-methylindole-5-methanesulfonamide SUMATRIPTAN Sumax
TypeSmall organic molecule
Emp. Form.C14H21N3O2S
Mol. Mass.295.4
SMILESCNS(=O)(=O)Cc1ccc2[nH]cc(CCN(C)C)c2c1