Reaction Details
TargetThromboxane A2 receptor
LigandBDBM50060458
Substrate/Competitorn/a
Meas. Tech.ChEMBL_207644 (CHEMBL811626)
IC50 0.13±n/a nM
Citation Tsuri, THonma, THiramatsu, YOkada, THashizume, HMitsumori, SInagaki, MArimura, AYasui, KAsanuma, FKishino, JOhtani, M Bicyclo[2.2.1]heptane and 6,6-dimethylbicyclo[3.1.1]heptane derivatives: orally active, potent, and selective prostaglandin D2 receptor antagonists. J Med Chem40:3504-7 (1997) 
 
Thromboxane A2 receptor
Name:Thromboxane A2 receptor
Type:Enyzme
Mol. Mass.:37445.28
Organism:Homo sapiens (Human)
Description:P21731
Residue:343
BDBM50060458
NameBDBM50060458
Synonyms:(Z)-7-[(1R,2S,3S,4S)-3-(Naphthalene-2-sulfonylamino)-bicyclo[2.2.1]hept-2-yl]-hept-5-enoic acid | CHEMBL435382
TypeSmall organic molecule
Emp. Form.C24H29NO4S
Mol. Mass.427.556
SMILESOC(=O)CCC\C=C/C[C@H]1[C@@H]2CC[C@@H](C2)[C@@H]1NS(=O)(=O)c1ccc2ccccc2c1