Reaction Details
TargetSerine/threonine-protein kinase B-raf
LigandBDBM50507712
Substrate/Competitorn/a
Meas. Tech.ChEMBL_1831424 (CHEMBL4331432)
IC50 0.200000±n/a nM
Citation Wang, LZhang, YZhang, QZhu, GZhang, ZDuan, CLu, TTang, W Discovery of potent Pan-Raf inhibitors with increased solubility to overcome drug resistance. Eur J Med Chem163:243-255 (2019) 
 
Serine/threonine-protein kinase B-raf
Name:Serine/threonine-protein kinase B-raf
Type:Serine/threonine-protein kinase
Mol. Mass.:84446.00
Organism:Homo sapiens (Human)
Description:P15056
Residue:766
BDBM50507712
NameBDBM50507712
Synonyms:CHEMBL4438001
TypeSmall organic molecule
Emp. Form.C24H20ClN5O2
Mol. Mass.445.901
SMILESCc1ccc(cc1NC(=O)C1(CC1)c1ncnc2[nH]ccc12)C(=O)Nc1cccc(Cl)c1