Reaction Details
TargetProto-oncogene tyrosine-protein kinase Src
LigandBDBM50060732
Substrate/Competitorn/a
Meas. Tech.ChEMBL_202592 (CHEMBL806416)
IC50 13000±n/a nM
Citation Plummer, MSHolland, DRShahripour, ALunney, EAFergus, JHMarks, JSMcConnell, PMueller, WTSawyer, TK Design, synthesis, and cocrystal structure of a nonpeptide Src SH2 domain ligand. J Med Chem40:3719-25 (1997) 
 
Proto-oncogene tyrosine-protein kinase Src
Name:Proto-oncogene tyrosine-protein kinase Src
Type:Protein
Mol. Mass.:59838.60
Organism:Homo sapiens (Human)
Description:P12931
Residue:536
BDBM50060732
NameBDBM50060732
Synonyms:(S)-4-[(3-Cyclohexyl-propyl)-methyl-carbamoyl]-4-[3-(6-phosphonooxy-naphthalen-1-yl)-ureido]-butyric acid | CHEMBL332418
TypeSmall organic molecule
Emp. Form.C26H36N3O8P
Mol. Mass.549.5531
SMILESCN(CCCC1CCCCC1)C(=O)[C@H](CCC(O)=O)NC(=O)Nc1cccc2cc(OP(O)(O)=O)ccc12