Reaction Details
TargetProto-oncogene tyrosine-protein kinase Src
LigandBDBM50060733
Substrate/Competitorn/a
Meas. Tech.ChEMBL_202592 (CHEMBL806416)
IC50 12000±n/a nM
Citation Plummer, MSHolland, DRShahripour, ALunney, EAFergus, JHMarks, JSMcConnell, PMueller, WTSawyer, TK Design, synthesis, and cocrystal structure of a nonpeptide Src SH2 domain ligand. J Med Chem40:3719-25 (1997) 
 
Proto-oncogene tyrosine-protein kinase Src
Name:Proto-oncogene tyrosine-protein kinase Src
Type:Protein
Mol. Mass.:59838.60
Organism:Homo sapiens (Human)
Description:P12931
Residue:536
BDBM50060733
NameBDBM50060733
Synonyms:(S)-4-[(3-Cyclohexyl-propyl)-methyl-carbamoyl]-4-[3-(4-phosphonooxy-benzyl)-ureido]-butyric acid | CHEMBL331979
TypeSmall organic molecule
Emp. Form.C23H36N3O8P
Mol. Mass.513.521
SMILESCN(CCCC1CCCCC1)C(=O)[C@H](CCC(O)=O)NC(=O)NCc1ccc(OP(O)(O)=O)cc1