Reaction Details
TargetProto-oncogene tyrosine-protein kinase Src
LigandBDBM50060735
Substrate/Competitorn/a
Meas. Tech.ChEMBL_202592 (CHEMBL806416)
IC50 500±n/a nM
Citation Plummer, MSHolland, DRShahripour, ALunney, EAFergus, JHMarks, JSMcConnell, PMueller, WTSawyer, TK Design, synthesis, and cocrystal structure of a nonpeptide Src SH2 domain ligand. J Med Chem40:3719-25 (1997) 
 
Proto-oncogene tyrosine-protein kinase Src
Name:Proto-oncogene tyrosine-protein kinase Src
Type:Protein
Mol. Mass.:59838.60
Organism:Homo sapiens (Human)
Description:P12931
Residue:536
BDBM50060735
NameBDBM50060735
Synonyms:2-[2-(2-{2-[(S)-2-Acetylamino-3-(4-phosphonooxy-phenyl)-propionylamino]-4-carboxy-butyrylamino}-4-carboxy-butyrylamino)-3-methyl-pentanoylamino]-pentanedioic acid | CHEMBL299477
TypeSmall organic molecule
Emp. Form.C32H46N5O17P
Mol. Mass.803.7047
SMILESCC[C@H](C)[C@H](NC(=O)[C@H](CCC(O)=O)NC(=O)[C@H](CCC(O)=O)NC(=O)[C@H](Cc1ccc(OP(O)(O)=O)cc1)NC(C)=O)C(=O)N[C@@H](CCC(O)=O)C(O)=O