Reaction Details
TargetProto-oncogene tyrosine-protein kinase Src
LigandBDBM50060736
Substrate/Competitorn/a
Meas. Tech.ChEMBL_202592 (CHEMBL806416)
IC50 800±n/a nM
Citation Plummer, MSHolland, DRShahripour, ALunney, EAFergus, JHMarks, JSMcConnell, PMueller, WTSawyer, TK Design, synthesis, and cocrystal structure of a nonpeptide Src SH2 domain ligand. J Med Chem40:3719-25 (1997) 
 
Proto-oncogene tyrosine-protein kinase Src
Name:Proto-oncogene tyrosine-protein kinase Src
Type:Protein
Mol. Mass.:59838.60
Organism:Homo sapiens (Human)
Description:P12931
Residue:536
BDBM50060736
NameBDBM50060736
Synonyms:(S)-4-[(S)-2-Acetylamino-3-(4-phosphonooxy-phenyl)-propionylamino]-4-(3-cyclohexyl-propylcarbamoyl)-butyric acid | CHEMBL122640
TypeSmall organic molecule
Emp. Form.C25H38N3O9P
Mol. Mass.555.5577
SMILESCC(=O)N[C@@H](Cc1ccc(OP(O)(O)=O)cc1)C(=O)N[C@@H](CCC(O)=O)C(=O)NCCCC1CCCCC1