Reaction Details
TargetProto-oncogene tyrosine-protein kinase Src
LigandBDBM50060737
Substrate/Competitorn/a
Meas. Tech.ChEMBL_202592 (CHEMBL806416)
IC50 7000±n/a nM
Citation Plummer, MSHolland, DRShahripour, ALunney, EAFergus, JHMarks, JSMcConnell, PMueller, WTSawyer, TK Design, synthesis, and cocrystal structure of a nonpeptide Src SH2 domain ligand. J Med Chem40:3719-25 (1997) 
 
Proto-oncogene tyrosine-protein kinase Src
Name:Proto-oncogene tyrosine-protein kinase Src
Type:Protein
Mol. Mass.:59838.60
Organism:Homo sapiens (Human)
Description:P12931
Residue:536
BDBM50060737
NameBDBM50060737
Synonyms:(S)-4-[3-Carboxymethyl-3-(4-phosphonooxy-benzyl)-ureido]-4-[(3-cyclohexyl-propyl)-methyl-carbamoyl]-butyric acid CHEMBL420910
TypeSmall organic molecule
Emp. Form.C25H38N3O10P
Mol. Mass.571.5571
SMILESCN(CCCC1CCCCC1)C(=O)[C@H](CCC(O)=O)NC(=O)N(CC(O)=O)Cc1ccc(OP(O)(O)=O)cc1