Reaction Details
TargetProto-oncogene tyrosine-protein kinase Src
LigandBDBM50060738
Substrate/Competitorn/a
Meas. Tech.ChEMBL_202592 (CHEMBL806416)
IC50 400±n/a nM
Citation Plummer, MSHolland, DRShahripour, ALunney, EAFergus, JHMarks, JSMcConnell, PMueller, WTSawyer, TK Design, synthesis, and cocrystal structure of a nonpeptide Src SH2 domain ligand. J Med Chem40:3719-25 (1997) 
 
Proto-oncogene tyrosine-protein kinase Src
Name:Proto-oncogene tyrosine-protein kinase Src
Type:Protein
Mol. Mass.:59838.60
Organism:Homo sapiens (Human)
Description:P12931
Residue:536
BDBM50060738
NameBDBM50060738
Synonyms:2-[2-(4-Carboxy-2-{4-carboxy-2-[(R)-3-carboxy-2-(4-phosphonooxy-benzyl)-propionylamino]-butyrylamino}-butyrylamino)-3-methyl-pentanoylamino]-pentanedioic acid | CHEMBL121873
TypeSmall organic molecule
Emp. Form.C32H45N4O18P
Mol. Mass.804.6895
SMILESCCC(C)C(NC(=O)C(CCC(O)=O)NC(=O)C(CCC(O)=O)NC(=O)[C@@H](CC(O)=O)Cc1ccc(OP(O)(O)=O)cc1)C(=O)NC(CCC(O)=O)C(O)=O