Reaction Details
Target5-lipoxygenase
LigandBDBM50269016
Substrate/Competitorn/a
Meas. Tech.ChEMBL_157766 (CHEMBL767669)
IC50>30000±n/a nM
Citation Müller, KPrinz, HGawlik, IZiereis, KHuang, HS Simple analogues of anthralin: unusual specificity of structure and antiproliferative activity. J Med Chem40:3773-80 (1997) 
 
5-lipoxygenase
Name:5-lipoxygenase
Synonyms:Arachidonate 5-lipoxygenase
Type:PROTEIN
Mol. Mass.:49994.23
Organism:Bos taurus
Description:ChEMBL_157766
Residue:430
BDBM50269016
NameBDBM50269016
TypeSmall organic molecule
Emp. Form.C21H22O9
Mol. Mass.418.394
SMILESOC[C@H]1O[C@H]([C@H](O)[C@@H](O)[C@@H]1O)C1c2cccc(O)c2C(=O)c2c(O)cc(CO)cc12