Reaction Details
TargetTubulin beta-2B chain
LigandBDBM50060956
Substrate/Competitorn/a
Meas. Tech.ChEMBL_211335 (CHEMBL820778)
IC50 2800±n/a nM
Citation Miller, TABulman, ALThompson, CDGarst, MEMacdonald, TL Synthesis and structure-activity profiles of A-homoestranes, the estratropones. J Med Chem40:3836-41 (1997) 
 
Tubulin beta-2B chain
Name:Tubulin beta-2B chain
Type:PROTEIN
Mol. Mass.:49932.38
Organism:Bos taurus
Description:ChEMBL_211651
Residue:445
BDBM50060956
NameBDBM50060956
Synonyms:(1S,3aS,3bR,10bS,12aS)-8-Chloro-1-hydroxy-12a-methyl-2,3,3a,3b,4,5,10b,11,12,12a-decahydro-1H-cyclohepta[a]cyclopenta[f]naphthalen-7-one | CHEMBL339413
TypeSmall organic molecule
Emp. Form.C19H23ClO2
Mol. Mass.318.838
SMILESC[C@]12CC[C@H]3[C@@H](CCc4cc(=O)c(Cl)ccc34)[C@@H]1CC[C@@H]2O