Reaction Details
TargetNeutrophil elastase
LigandBDBM50061022
Substrate/Competitorn/a
Meas. Tech.ChEMBL_63839 (CHEMBL674889)
Ki 15±n/a nM
Citation Veale, CABernstein, PRBohnert, CMBrown, FJBryant, CDamewood, JREarley, RFeeney, SWEdwards, PDGomes, BHulsizer, JMKosmider, BJKrell, RDMoore, GSalcedo, TWShaw, ASilberstein, DSSteelman, GBStein, MStrimpler, AThomas, RMVacek, EPWilliams, JCWolanin, DJWoolson, S Orally active trifluoromethyl ketone inhibitors of human leukocyte elastase. J Med Chem40:3173-81 (1997) 
 
Neutrophil elastase
Name:Neutrophil elastase
Type:Enzyme
Mol. Mass.:28532.38
Organism:Homo sapiens (Human)
Description:P08246
Residue:267
BDBM50061022
NameBDBM50061022
Synonyms:(S)-1-[(S)-2-(4-Methoxy-benzoylamino)-3-methyl-butyryl]-pyrrolidine-2-carboxylic acid ((S)-4-amino-3,3-difluoro-1-isopropyl-2-oxo-butyl)-amide CHEMBL306676
TypeSmall organic molecule
Emp. Form.C25H36F2N4O5
Mol. Mass.510.5739
SMILESCOc1ccc(cc1)C(=O)N[C@@H](C(C)C)C(=O)N1CCC[C@H]1C(=O)N[C@@H](C(C)C)C(=O)C(F)(F)CN