Reaction Details
TargetNeutrophil elastase
LigandBDBM50061029
Substrate/Competitorn/a
Meas. Tech.ChEMBL_63839 (CHEMBL674889)
Ki 5.8±n/a nM
Citation Veale, CABernstein, PRBohnert, CMBrown, FJBryant, CDamewood, JREarley, RFeeney, SWEdwards, PDGomes, BHulsizer, JMKosmider, BJKrell, RDMoore, GSalcedo, TWShaw, ASilberstein, DSSteelman, GBStein, MStrimpler, AThomas, RMVacek, EPWilliams, JCWolanin, DJWoolson, S Orally active trifluoromethyl ketone inhibitors of human leukocyte elastase. J Med Chem40:3173-81 (1997) 
 
Neutrophil elastase
Name:Neutrophil elastase
Type:Enzyme
Mol. Mass.:28532.38
Organism:Homo sapiens (Human)
Description:P08246
Residue:267
BDBM50061029
NameBDBM50061029
Synonyms:CHEMBL321817 | {(S)-2-Methyl-1-[(S)-2-((S)-3,3,3-trifluoro-1-isopropyl-2-oxo-propylcarbamoyl)-pyrrolidine-1-carbonyl]-propyl}-carbamic acid isopropyl ester
TypeSmall organic molecule
Emp. Form.C20H32F3N3O5
Mol. Mass.451.4804
SMILESCC(C)OC(=O)N[C@@H](C(C)C)C(=O)N1CCC[C@H]1C(=O)N[C@@H](C(C)C)C(=O)C(F)(F)F