Reaction Details
TargetNeutrophil elastase
LigandBDBM50061055
Substrate/Competitorn/a
Meas. Tech.ChEMBL_63839 (CHEMBL674889)
Ki 130±n/a nM
Citation Veale, CABernstein, PRBohnert, CMBrown, FJBryant, CDamewood, JREarley, RFeeney, SWEdwards, PDGomes, BHulsizer, JMKosmider, BJKrell, RDMoore, GSalcedo, TWShaw, ASilberstein, DSSteelman, GBStein, MStrimpler, AThomas, RMVacek, EPWilliams, JCWolanin, DJWoolson, S Orally active trifluoromethyl ketone inhibitors of human leukocyte elastase. J Med Chem40:3173-81 (1997) 
 
Neutrophil elastase
Name:Neutrophil elastase
Type:Enzyme
Mol. Mass.:28532.38
Organism:Homo sapiens (Human)
Description:P08246
Residue:267
BDBM50061055
NameBDBM50061055
Synonyms:CHEMBL107993 {(S)-1-[(S)-2-((S)-4-Amino-3,3-difluoro-1-isopropyl-2-oxo-butylcarbamoyl)-pyrrolidine-1-carbonyl]-2-methyl-propyl}-carbamic acid benzyl ester
TypeSmall organic molecule
Emp. Form.C25H36F2N4O5
Mol. Mass.510.5739
SMILESCC(C)[C@H](NC(=O)OCc1ccccc1)C(=O)N1CCC[C@H]1C(=O)N[C@@H](C(C)C)C(=O)C(F)(F)CN