Reaction Details
TargetCannabinoid receptor 2
LigandBDBM50061194
Substrate/Competitorn/a
Meas. Tech.ChEMBL_47006 (CHEMBL658675)
Ki 200±n/a nM
Citation Reggio, PHWang, TBrown, AEFleming, DNSeltzman, HHGriffin, GPertwee, RGCompton, DRAbood, MEMartin, BR Importance of the C-1 substituent in classical cannabinoids to CB2 receptor selectivity: synthesis and characterization of a series of O,2-propano-delta 8-tetrahydrocannabinol analogs. J Med Chem40:3312-8 (1997) 
 
Cannabinoid receptor 2
Name:Cannabinoid receptor 2
Type:Enzyme
Mol. Mass.:39366.68
Organism:Rattus norvegicus (Rat)
Description:Q9QZN9
Residue:360
BDBM50061194
NameBDBM50061194
Synonyms:(R)-8,8-Dimethyl-11-methylene-5-pentyl-3,4,8a,9,10,11,12,12a-octahydro-2H,8H-1,7-dioxa-benzo[c]phenanthrene | CHEMBL114078
TypeSmall organic molecule
Emp. Form.C24H34O2
Mol. Mass.354.5256
SMILESCCCCCc1cc2OC(C)(C)[C@@H]3CCC(=C)CC3c2c2OCCCc12