Reaction Details
TargetCannabinoid receptor 2
LigandBDBM50061198
Substrate/Competitorn/a
Meas. Tech.ChEMBL_47006 (CHEMBL658675)
Ki 128±n/a nM
Citation Reggio, PHWang, TBrown, AEFleming, DNSeltzman, HHGriffin, GPertwee, RGCompton, DRAbood, MEMartin, BR Importance of the C-1 substituent in classical cannabinoids to CB2 receptor selectivity: synthesis and characterization of a series of O,2-propano-delta 8-tetrahydrocannabinol analogs. J Med Chem40:3312-8 (1997) 
 
Cannabinoid receptor 2
Name:Cannabinoid receptor 2
Type:Enzyme
Mol. Mass.:39366.68
Organism:Rattus norvegicus (Rat)
Description:Q9QZN9
Residue:360
BDBM50061198
NameBDBM50061198
Synonyms:(R)-8,8-Dimethyl-5-pentyl-3,4,8a,9,12,12a-hexahydro-2H,8H-1,7-dioxa-benzo[c]phenanthrene | CHEMBL113247
TypeSmall organic molecule
Emp. Form.C23H32O2
Mol. Mass.340.499
SMILESCCCCCc1cc2OC(C)(C)[C@@H]3CC=CCC3c2c2OCCCc12