Reaction Details
TargetCannabinoid receptor 1
LigandBDBM50061198
Substrate/Competitorn/a
Meas. Tech.ChEMBL_46644 (CHEMBL658899)
Ki 364±n/a nM
Citation Reggio, PHWang, TBrown, AEFleming, DNSeltzman, HHGriffin, GPertwee, RGCompton, DRAbood, MEMartin, BR Importance of the C-1 substituent in classical cannabinoids to CB2 receptor selectivity: synthesis and characterization of a series of O,2-propano-delta 8-tetrahydrocannabinol analogs. J Med Chem40:3312-8 (1997) 
 
Cannabinoid receptor 1
Name:Cannabinoid receptor 1
Type:G Protein-Coupled Receptor (GPCR)
Mol. Mass.:52856.55
Organism:Rattus norvegicus (rat)
Description:P20272
Residue:473
BDBM50061198
NameBDBM50061198
Synonyms:(R)-8,8-Dimethyl-5-pentyl-3,4,8a,9,12,12a-hexahydro-2H,8H-1,7-dioxa-benzo[c]phenanthrene | CHEMBL113247
TypeSmall organic molecule
Emp. Form.C23H32O2
Mol. Mass.340.499
SMILESCCCCCc1cc2OC(C)(C)[C@@H]3CC=CCC3c2c2OCCCc12