Reaction Details
Target5-hydroxytryptamine receptor 2C
LigandBDBM50010594
Substrate/Competitorn/a
Meas. Tech.ChEMBL_2809 (CHEMBL617839)
IC50 2.9±n/a nM
Citation Liao, YDeBoer, PMeier, EWikström, H Synthesis and pharmacological evaluation of triflate-substituted analogues of clozapine: identification of a novel atypical neuroleptic. J Med Chem40:4146-53 (1998) 
 
5-hydroxytryptamine receptor 2C
Name:5-hydroxytryptamine receptor 2C
Type:Enzyme
Mol. Mass.:51935.10
Organism:Rattus norvegicus (Rat)
Description:P08909
Residue:460
BDBM50010594
NameBDBM50010594
Synonyms:2-Chloro-11-(4-methyl-piperazin-1-yl)-5H-dibenzo[b,e][1,4]diazepine CHEMBL415300 | ISOCLOZAPINE
TypeSmall organic molecule
Emp. Form.C18H19ClN4
Mol. Mass.326.823
SMILESCN1CCN(CC1)C1=Nc2ccccc2Nc2ccc(Cl)cc12