Reaction Details
TargetReverse transcriptase/RNaseH
LigandBDBM50032235
Substrate/Competitorn/a
Meas. Tech.ChEMBL_197283 (CHEMBL804270)
EC50 1.6±n/a nM
Citation Kireev, DBChrétien, JRGrierson, DSMonneret, C A 3D QSAR study of a series of HEPT analogues: the influence of conformational mobility on HIV-1 reverse transcriptase inhibition. J Med Chem40:4257-64 (1998) 
 
Reverse transcriptase/RNaseH
Name:Reverse transcriptase/RNaseH
Type:PROTEIN
Mol. Mass.:65229.15
Organism:Human immunodeficiency virus 1
Description:ChEMBL_1473730
Residue:566
BDBM50032235
NameBDBM50032235
Synonyms:6-(3,5-Dimethyl-benzyl)-1-ethoxymethyl-5-ethyl-1H-pyrimidine-2,4-dione CHEMBL310976
TypeSmall organic molecule
Emp. Form.C18H24N2O3
Mol. Mass.316.3948
SMILESCCOCn1c(Cc2cc(C)cc(C)c2)c(CC)c(=O)[nH]c1=O