Reaction Details
TargetReverse transcriptase/RNaseH
LigandBDBM50008329
Substrate/Competitorn/a
Meas. Tech.ChEMBL_197283 (CHEMBL804270)
EC50 2.7±n/a nM
Citation Kireev, DBChrétien, JRGrierson, DSMonneret, C A 3D QSAR study of a series of HEPT analogues: the influence of conformational mobility on HIV-1 reverse transcriptase inhibition. J Med Chem40:4257-64 (1998) 
 
Reverse transcriptase/RNaseH
Name:Reverse transcriptase/RNaseH
Type:PROTEIN
Mol. Mass.:65229.15
Organism:Human immunodeficiency virus 1
Description:ChEMBL_1473730
Residue:566
BDBM50008329
NameBDBM50008329
Synonyms:6-(3,5-Dimethyl-phenylsulfanyl)-1-(2-hydroxy-ethoxymethyl)-5-isopropyl-1H-pyrimidine-2,4-dione | CHEMBL276108
TypeSmall organic molecule
Emp. Form.C18H24N2O4S
Mol. Mass.364.459
SMILESCC(C)c1c(Sc2cc(C)cc(C)c2)n(COCCO)c(=O)[nH]c1=O