Reaction Details
TargetReverse transcriptase/RNaseH
LigandBDBM50008325
Substrate/Competitorn/a
Meas. Tech.ChEMBL_197283 (CHEMBL804270)
EC50 10000±n/a nM
Citation Kireev, DBChrétien, JRGrierson, DSMonneret, C A 3D QSAR study of a series of HEPT analogues: the influence of conformational mobility on HIV-1 reverse transcriptase inhibition. J Med Chem40:4257-64 (1998) 
 
Reverse transcriptase/RNaseH
Name:Reverse transcriptase/RNaseH
Type:PROTEIN
Mol. Mass.:65229.15
Organism:Human immunodeficiency virus 1
Description:ChEMBL_1473730
Residue:566
BDBM50008325
NameBDBM50008325
Synonyms:1-(2-Hydroxy-ethoxymethyl)-6-(3-iodo-phenylsulfanyl)-5-methyl-1H-pyrimidine-2,4-dione | CHEMBL16628
TypeSmall organic molecule
Emp. Form.C14H15IN2O4S
Mol. Mass.434.249
SMILESCc1c(Sc2cccc(I)c2)n(COCCO)c(=O)[nH]c1=O