Reaction Details
TargetReverse transcriptase/RNaseH
LigandBDBM50004143
Substrate/Competitorn/a
Meas. Tech.ChEMBL_197283 (CHEMBL804270)
EC50 220±n/a nM
Citation Kireev, DBChrétien, JRGrierson, DSMonneret, C A 3D QSAR study of a series of HEPT analogues: the influence of conformational mobility on HIV-1 reverse transcriptase inhibition. J Med Chem40:4257-64 (1998) 
 
Reverse transcriptase/RNaseH
Name:Reverse transcriptase/RNaseH
Type:PROTEIN
Mol. Mass.:65229.15
Organism:Human immunodeficiency virus 1
Description:ChEMBL_1473730
Residue:566
BDBM50004143
NameBDBM50004143
Synonyms:5-Ethyl-1-isobutyl-6-phenylsulfanyl-2-thioxo-2,3-dihydro-1H-pyrimidin-4-one | CHEMBL135996
TypeSmall organic molecule
Emp. Form.C16H20N2OS2
Mol. Mass.320.473
SMILESCCc1c(Sc2ccccc2)n(CC(C)C)c(=S)[nH]c1=O