Reaction Details
TargetReverse transcriptase/RNaseH
LigandBDBM50008305
Substrate/Competitorn/a
Meas. Tech.ChEMBL_197283 (CHEMBL804270)
EC50 140000±n/a nM
Citation Kireev, DBChrétien, JRGrierson, DSMonneret, C A 3D QSAR study of a series of HEPT analogues: the influence of conformational mobility on HIV-1 reverse transcriptase inhibition. J Med Chem40:4257-64 (1998) 
 
Reverse transcriptase/RNaseH
Name:Reverse transcriptase/RNaseH
Type:PROTEIN
Mol. Mass.:65229.15
Organism:Human immunodeficiency virus 1
Description:ChEMBL_1473730
Residue:566
BDBM50008305
NameBDBM50008305
Synonyms:1-(2-Hydroxy-ethoxymethyl)-5-methyl-6-(2-nitro-phenylsulfanyl)-1H-pyrimidine-2,4-dione | CHEMBL274458
TypeSmall organic molecule
Emp. Form.C14H15N3O6S
Mol. Mass.353.35
SMILESCc1c(Sc2ccccc2[N+]([O-])=O)n(COCCO)c(=O)[nH]c1=O