Reaction Details
TargetReverse transcriptase/RNaseH
LigandBDBM50008320
Substrate/Competitorn/a
Meas. Tech.ChEMBL_197283 (CHEMBL804270)
EC50 10000±n/a nM
Citation Kireev, DBChrétien, JRGrierson, DSMonneret, C A 3D QSAR study of a series of HEPT analogues: the influence of conformational mobility on HIV-1 reverse transcriptase inhibition. J Med Chem40:4257-64 (1998) 
 
Reverse transcriptase/RNaseH
Name:Reverse transcriptase/RNaseH
Type:PROTEIN
Mol. Mass.:65229.15
Organism:Human immunodeficiency virus 1
Description:ChEMBL_1473730
Residue:566
BDBM50008320
NameBDBM50008320
Synonyms:3-[3-(2-Hydroxy-ethoxymethyl)-5-methyl-2,6-dioxo-1,2,3,6-tetrahydro-pyrimidin-4-ylsulfanyl]-benzonitrile | CHEMBL279579
TypeSmall organic molecule
Emp. Form.C15H15N3O4S
Mol. Mass.333.362
SMILESCc1c(Sc2cccc(c2)C#N)n(COCCO)c(=O)[nH]c1=O