Reaction Details
TargetReverse transcriptase/RNaseH
LigandBDBM50004129
Substrate/Competitorn/a
Meas. Tech.ChEMBL_197283 (CHEMBL804270)
EC50 19±n/a nM
Citation Kireev, DBChrétien, JRGrierson, DSMonneret, C A 3D QSAR study of a series of HEPT analogues: the influence of conformational mobility on HIV-1 reverse transcriptase inhibition. J Med Chem40:4257-64 (1998) 
 
Reverse transcriptase/RNaseH
Name:Reverse transcriptase/RNaseH
Type:PROTEIN
Mol. Mass.:65229.15
Organism:Human immunodeficiency virus 1
Description:ChEMBL_1473730
Residue:566
BDBM50004129
NameBDBM50004129
Synonyms:1-Ethoxymethyl-5-ethyl-6-phenylsulfanyl-1H-pyrimidine-2,4-dione | CHEMBL36995
TypeSmall organic molecule
Emp. Form.C15H18N2O3S
Mol. Mass.306.38
SMILESCCOCn1c(Sc2ccccc2)c(CC)c(=O)[nH]c1=O